Target
Thymidine phosphorylase
Ligand
BDBM20040
Substrate
BDBM1
Meas. Tech.
Enzyme Inhibition Assay
IC50
6100±n/a nM
Citation
 Nencka, RVotruba, IHrebabecký, HTloust'ová, EHorská, KMasojídková, MHolý, A Design and synthesis of novel 5,6-disubstituted uracil derivatives as potent inhibitors of thymidine phosphorylase. Bioorg Med Chem Lett 16:1335-7 (2006)  
Target
Name:
Thymidine phosphorylase
Synonyms:
TYPH_ECOLI Thymidine Phosphorylase (TP) tpp | ttg
Type:
Enzyme
Mol. Mass.:
47198.54
Organism:
Escherichia coli
Description:
Residue:
440
  
Inhibitor
Name:
BDBM20040
Synonyms:
5-bromo-6-[4-(2-hydroxyethyl)piperidin-1-yl]-1,3-diazinane-2,4-dione | uracil, 10
Type:
Small organic molecule
Emp. Form.:
C11H16BrN3O3
Mol. Mass.:
318.167
SMILES:
OCCC1CCN(CC1)c1[nH]c(=O)[nH]c(=O)c1Br
:
Substrate
Name:
BDBM1
Synonyms:
dT | thymidine
Type:
Nucleoside or nucleotide
Emp. Form.:
C10H14N2O5
Mol. Mass.:
242.2286
SMILES:
Cc1cn([C@H]2C[C@H](O)[C@@H](CO)O2)c(=O)[nH]c1=O
: