Target
Procathepsin L
Ligand
BDBM20111
Substrate
BDBM20128
Meas. Tech.
Papain Inhibition Assay
Ki
320±n/a nM
Citation
 Löser, RSchilling, KDimmig, EGütschow, M Interaction of papain-like cysteine proteases with dipeptide-derived nitriles. J Med Chem 48:7688-707 (2005)  
Target
Name:
Procathepsin L
Synonyms:
CATL1_BOVIN CTSL1 Cathepsin L1 heavy chain | Cathepsin L1 light chain
Type:
Enzyme
Mol. Mass.:
37349.52
Organism:
Bos taurus (bovine)
Description:
Bovine liver cathepsin L was purchased from Calbiochem.
Residue:
334
  
Inhibitor
Name:
BDBM20111
Synonyms:
dipeptide-derived nitrile, 32 | tert-butyl N-[(1S)-2-(1-benzothiophen-3-yl)-1-[(cyanomethyl)carbamoyl]ethyl]carbamate
Type:
Small organic molecule
Emp. Form.:
C18H21N3O3S
Mol. Mass.:
359.443
SMILES:
CC(C)(C)OC(=O)N[C@@H](Cc1csc2ccccc12)C(=O)NCC#N
:
Substrate
Name:
BDBM20128
Synonyms:
Z-Phe-Arg-NH-4-methylcoumarin-7-yl | Z-Phe-Arg-NHMec
Type:
Emp. Form.:
Mol. Mass.:
SMILES:
: