Target
High affinity nerve growth factor receptor
Ligand
BDBM364513
Substrate
Meas. Tech.
Biological Assay
IC50
13.0±n/a nM
Citation
 Mitchell, HWood, HBLi, CSMao, QQi, Z TrkA kinase inhibitors, compositions and methods thereof US Patent  US9862707 Publication Date 1/9/2018 
Target
Name:
High affinity nerve growth factor receptor
Synonyms:
2.7.10.1 NTRK1 NTRK1_HUMAN Neurotrophic tyrosine kinase receptor type 1 Synonyms=MTC TRK1-transforming tyrosine kinase protein TRKA GN Tropomyosin alpha-3 chain/High affinity nerve growth factor receptor Tropomyosin-related kinase A (TrkA) Tyrosine kinase receptor (Trk) Tyrosine kinase receptor A (Trk A) Tyrosine kinase receptor A (TrkA) p140-TrkA
Type:
Mol. Mass.:
87498.18
Organism:
Homo sapiens (Human)
Description:
P04629
Residue:
796
  
Inhibitor
Name:
BDBM364513
Synonyms:
2-phenyl-3-({[3-pyrimidin-2-yl-4- (trifluoromethyl)phenyl]carbonyl} amino)-2H-pyrazolo[4,3-b]pyridine- 6-carboxamide | US9862707, Example 88
Type:
Small organic molecule
Emp. Form.:
C25H16F3N7O2
Mol. Mass.:
503.4354
SMILES:
NC(=O)c1cnc2c(NC(=O)c3ccc(c(c3)-c3ncccn3)C(F)(F)F)n(nc2c1)-c1ccccc1
: