Target
Kappa-type opioid receptor
Ligand
BDBM364552
Substrate
Meas. Tech.
kappa-Opioid Receptor Binding Assay
Ki
0.032±0.01 nM
Citation
 Youngman, M Opioid receptor modulating oxabicyclo[2.2.2]octane morphinans US Patent  US9862726 Publication Date 1/9/2018 
Target
Name:
Kappa-type opioid receptor
Synonyms:
K-OR-1 Kappa-opioid receptor (KOR) Kappa-type opioid receptor (KOR) OPIATE Kappa OPRK1 kappa opioid receptor (KOR)
Type:
G Protein-Coupled Receptor (GPCR)
Mol. Mass.:
42648.76
Organism:
Homo sapiens (Human)
Description:
P41145
Residue:
380
  
Inhibitor
Name:
BDBM364552
Synonyms:
N-((4bR,6S,8aS,9R)-11- (cyclopropylmethyl)- 3-methoxy-5,6,7,8,9,10-hexahydro-9,4b- (epiminoethano)-8a,6- (epoxymethano)phenanthren-6- yl)benzamide | US9862726, Compound 18
Type:
Small organic molecule
Emp. Form.:
C29H34N2O3
Mol. Mass.:
458.5919
SMILES:
COc1ccc2C[C@H]3N(CC4CC4)CC[C@@]4(CC5(CC[C@@]34OC5)NC(=O)c3ccccc3)c2c1
: