Target
Oxysterols receptor LXR-alpha
Ligand
BDBM19992
Substrate
biotinylated SRC-1 peptide
Meas. Tech.
Cell-Free Ligand Sensing Assay (LiSA)-LXRalpha-SRC1 Assay
pH
7.5±n/a
Temperature
295.15±n/a K
EC50
80±45 nM
Comments
The relative efficacy (RE) compared to GW3965 is 1 in LXRalpha-SRC1 assay. The EC50=0.17 +/-0.01 uM for ABCA1 gene expression with RE=1.
Citation
 Jaye, MCKrawiec, JACampobasso, NSmallwood, AQiu, CLu, QKerrigan, JJDe Los Frailes Alvaro, MLaffitte, BLiu, WSMarino, JPMeyer, CRNichols, JAParks, DJPerez, PSarov-Blat, LSeepersaud, SDSteplewski, KMThompson, SKWang, PWatson, MAWebb, CLHaigh, DCaravella, JAMacphee, CHWillson, TMCollins, JL Discovery of substituted maleimides as liver X receptor agonists and determination of a ligand-bound crystal structure. J Med Chem 48:5419-22 (2005)  
Target
Name:
Oxysterols receptor LXR-alpha
Synonyms:
LXRA Liver X receptor alpha Liver X receptor alpha (NR1H3) NR1H3 Nuclear orphan receptor LXR-alpha | Nuclear receptor subfamily 1 group H member 3
Type:
Enzyme Catalytic Domain
Mol. Mass.:
50403.85
Organism:
Homo sapiens (Human)
Description:
Q13133
Residue:
447
  
Inhibitor
Name:
BDBM19992
Synonyms:
2-[3-[3-[[2-chloro-3-(trifluoromethyl)phenyl]methyl-[2,2-di(phenyl)ethyl]amino]propoxy]phenyl]acetic acid CHEMBL59030 GW3965 US10669296, Compound GW3965 | US10945978, Compound 2
Type:
Small organic molecule
Emp. Form.:
C33H31ClF3NO3
Mol. Mass.:
582.052
SMILES:
OC(=O)Cc1cccc(OCCCN(CC(c2ccccc2)c2ccccc2)Cc2cccc(c2Cl)C(F)(F)F)c1
:
Substrate
Name:
biotinylated SRC-1 peptide
Synonyms:
Type:
Peptide
Mol. Mass.:
3157.52
Organism:
Description:
A biotinylated peptide comprises amino acids 675-699 of steroid receptor coactivator 1 (SRC1).
Residue:
28