Target
Mitogen-activated protein kinase kinase kinase 12
Ligand
BDBM365237
Substrate
Meas. Tech.
TR-FRET assay
Ki
3.10±n/a nM
Citation
 Cohen, FPatel, S C-linked heterocycloaklyl substituted pyrimidines and their uses US Patent  US9868720 Publication Date 1/16/2018 
Target
Name:
Mitogen-activated protein kinase kinase kinase 12
Synonyms:
DLK Leucine-zipper protein kinase MAP3K12 MUK Mixed lineage kinase | ZPK
Type:
PROTEIN
Mol. Mass.:
93216.56
Organism:
Homo sapiens (Human)
Description:
ChEMBL_1460553
Residue:
859
  
Inhibitor
Name:
BDBM365237
Synonyms:
US9868720, No. 96 | [2-(3,3-Difluoro-piperidin- 1-yl)-6-pyrrolidin-3- yl-pyrimidin-4-yl]-(4-tri- fluoromethyl-pyridin- 2-yl)-amine
Type:
Small organic molecule
Emp. Form.:
C19H21F5N6
Mol. Mass.:
428.4023
SMILES:
FC(F)(F)c1ccnc(Nc2cc(nc(n2)N2CCCC(F)(F)C2)C2CCNC2)c1
: