Target
Mitogen-activated protein kinase kinase kinase 12
Ligand
BDBM365240
Substrate
Meas. Tech.
TR-FRET assay
Ki
0.850±n/a nM
Citation
 Cohen, FPatel, S C-linked heterocycloaklyl substituted pyrimidines and their uses US Patent  US9868720 Publication Date 1/16/2018 
Target
Name:
Mitogen-activated protein kinase kinase kinase 12
Synonyms:
DLK Leucine-zipper protein kinase MAP3K12 MUK Mixed lineage kinase | ZPK
Type:
PROTEIN
Mol. Mass.:
93216.56
Organism:
Homo sapiens (Human)
Description:
ChEMBL_1460553
Residue:
859
  
Inhibitor
Name:
BDBM365240
Synonyms:
US9868720, No. 111 | [2-((R)-2-Methyl-pyrrolidin- 1-yl)-6-piperidin-4- yl-pyrimidin-4-yl]-(4- trifluoromethyl-pyridin- 2-yl)-amine
Type:
Small organic molecule
Emp. Form.:
C20H25F3N6
Mol. Mass.:
406.4479
SMILES:
C[C@@H]1CCCN1c1nc(Nc2cc(ccn2)C(F)(F)F)cc(n1)C1CCNCC1
: