Target
Mitogen-activated protein kinase kinase kinase 12
Ligand
BDBM365259
Substrate
Meas. Tech.
TR-FRET assay
Ki
3.20±n/a nM
Citation
 Cohen, FPatel, S C-linked heterocycloaklyl substituted pyrimidines and their uses US Patent  US9868720 Publication Date 1/16/2018 
Target
Name:
Mitogen-activated protein kinase kinase kinase 12
Synonyms:
DLK Leucine-zipper protein kinase MAP3K12 MUK Mixed lineage kinase | ZPK
Type:
PROTEIN
Mol. Mass.:
93216.56
Organism:
Homo sapiens (Human)
Description:
ChEMBL_1460553
Residue:
859
  
Inhibitor
Name:
BDBM365259
Synonyms:
US9868720, No. 201 | [2-(3,3-Difluoro-pyrrolidin- 1-yl)-6-piperidin-4- yl-pyrimidin-4-yl]-(4- thiophen-2-yl-pyridin-2-yl)- amine
Type:
Small organic molecule
Emp. Form.:
C22H24F2N6S
Mol. Mass.:
442.528
SMILES:
FC1(F)CCN(C1)c1nc(Nc2cc(ccn2)-c2cccs2)cc(n1)C1CCNCC1
: