Target
Mitogen-activated protein kinase kinase kinase 12
Ligand
BDBM365260
Substrate
Meas. Tech.
TR-FRET assay
Ki
0.950±n/a nM
Citation
 Cohen, FPatel, S C-linked heterocycloaklyl substituted pyrimidines and their uses US Patent  US9868720 Publication Date 1/16/2018 
Target
Name:
Mitogen-activated protein kinase kinase kinase 12
Synonyms:
DLK Leucine-zipper protein kinase MAP3K12 MUK Mixed lineage kinase | ZPK
Type:
PROTEIN
Mol. Mass.:
93216.56
Organism:
Homo sapiens (Human)
Description:
ChEMBL_1460553
Residue:
859
  
Inhibitor
Name:
BDBM365260
Synonyms:
(4-Cyclopropyl-pyridin- 2-yl)-[2-((R)-2-methyl- pyrrolidin-1-yl)-6- piperidin-4-yl-pyrimidin-4- yl]-amine | US9868720, No. 202
Type:
Small organic molecule
Emp. Form.:
C22H30N6
Mol. Mass.:
378.5138
SMILES:
C[C@@H]1CCCN1c1nc(Nc2cc(ccn2)C2CC2)cc(n1)C1CCNCC1
: