Target
Estrogen receptor beta
Ligand
BDBM20620
Substrate
17beta-estradiol (E2)
Meas. Tech.
ER-alpha Radioligand Binding Assay and ERE-Luciferase Reporter Assay.
Temperature
298.15±n/a K
IC50
1945±n/a nM
EC50
491±n/a nM
Comments
extracted
Citation
 Renaud, JBischoff, SFBuhl, TFloersheim, PFournier, BGeiser, MHalleux, CKallen, JKeller, HRamage, P Selective estrogen receptor modulators with conformationally restricted side chains. Synthesis and structure-activity relationship of ERalpha-selective tetrahydroisoquinoline ligands. J Med Chem 48:364-79 (2005)  
Target
Name:
Estrogen receptor beta
Synonyms:
ER-beta ESR2_HUMAN Estradiol receptor beta (ERβ) Estrogen receptor (ER beta) Estrogen receptor beta (ER beta) NR3A2 estrogen beta
Type:
Protein
Mol. Mass.:
59238.43
Organism:
Homo sapiens (Human)
Description:
Q92731
Residue:
530
  
Inhibitor
Name:
BDBM20620
Synonyms:
2-(3-hydroxyphenyl)-1-{4-[4-(2-methylpropyl)piperazin-1-yl]phenyl}-1,2,3,4-tetrahydroisoquinolin-6-ol | Piperazine Derivative, 47
Type:
Small organic molecule
Emp. Form.:
C29H35N3O2
Mol. Mass.:
457.6071
SMILES:
CC(C)CN1CCN(CC1)c1ccc(cc1)C1N(CCc2cc(O)ccc12)c1cccc(O)c1
:
Substrate
Name:
BDBM17292
Synonyms:
(1S,10R,11S,14S,15S)-15-methyltetracyclo[8.7.0.0^{2,7}.0^{11,15}]heptadeca-2,4,6-triene-5,14-diol 17α-ethinylestradiol CHEMBL135 ESTRADIOL Ovocyclin US9040509, E2 US9561238, E2 [2,4,6,7-3H]-E2 [3H]]estradiol
Type:
Steroid
Emp. Form.:
C18H24O2
Mol. Mass.:
272.382
SMILES:
[H][C@@]12CC[C@H](O)[C@@]1(C)CC[C@]1([H])c3ccc(O)cc3CC[C@@]21[H]
: