Target
Hemagglutinin
Ligand
BDBM31148
Substrate
Meas. Tech.
Endonuclease Assay
pH
7.5±n/a
IC50
24000±n/a nM
Comments
extracted
Citation
 Lavoie, EJBauman, JDSagong, HYArnold, EParhi, ADas, KVijayan, SKPatel, D Therapeutic hydroxyquinolones US Patent  US9701638 Publication Date 7/11/2017 
Target
Name:
Hemagglutinin
Synonyms:
HA | Hemagglutinin HA1 chain
Type:
Enzyme Catalytic Domain
Mol. Mass.:
63281.44
Organism:
Influenza A virus (strain swl A/California/04/2009 H1N1)
Description:
C3W5S1
Residue:
566
  
Inhibitor
Name:
BDBM31148
Synonyms:
3-hydroxyquinolin-2(1H)-one, 2 | US9701638, 1
Type:
Small organic molecule
Emp. Form.:
C9H7NO2
Mol. Mass.:
161.1574
SMILES:
Oc1cc2ccccc2[nH]c1=O
: