Target
Cyclin-dependent kinase 5 activator 1 [99-307]
Ligand
BDBM20850
Substrate
Histone H1
Meas. Tech.
CDK Inhibition Assay
pH
7.5±n/a
Temperature
298.15±n/a K
IC50
4.4±0.7 nM
Citation
 Zhong, WLiu, HKaller, MRHenley, CMagal, ENguyen, TOsslund, TDPowers, DRzasa, RMWang, HLWang, WXiong, XZhang, JNorman, MH Design and synthesis of quinolin-2(1H)-one derivatives as potent CDK5 inhibitors. Bioorg Med Chem Lett 17:5384-9 (2007)  
Target
Name:
Cyclin-dependent kinase 5 activator 1 [99-307]
Synonyms:
CDK5/p25 | Cyclin-Dependent Kinase 5 (CDK5)
Type:
Protein Complex
Mol. Mass.:
Description:
Components:
This complex has 2 components.
Component 1
Name:
Cyclin-dependent kinase 5
Synonyms:
CDK5 CDKN5 Cyclin-dependent kinase 5 (CDK5/ p25) Cyclin-dependent-like kinase 5 PSSALRE Tau protein kinase II catalytic subunit
Type:
Enzyme Subunit
Mol. Mass.:
33308.61
Organism:
Homo sapiens (Human)
Description:
Residue:
292
  
Component 2
Name:
Cyclin-dependent kinase 5 activator 1 [99-307]
Synonyms:
CD5R1_HUMAN CDK5R1 Cyclin-dependent kinase 5 activator 1, p25 TPKII regulatory subunit | p25
Type:
Enzyme Subunit
Mol. Mass.:
23250.56
Organism:
Homo sapiens (Human)
Description:
Q15078 aa 99-307
Residue:
209
  
Inhibitor
Name:
BDBM20850
Synonyms:
7-[(4-methylpiperazin-1-yl)carbonyl]-3-[2-(pyridin-4-yl)-1,3-thiazol-4-yl]-1,2-dihydroquinolin-2-one | quinolin-2(1H)-one derivative, 9h
Type:
Small organic molecule
Emp. Form.:
C23H21N5O2S
Mol. Mass.:
431.51
SMILES:
CN1CCN(CC1)C(=O)c1ccc2cc(-c3csc(n3)-c3ccncc3)c(=O)[nH]c2c1
:
Substrate
Name:
Histone H1
Synonyms:
Type:
Other Protein Type
Mol. Mass.:
358.43
Organism:
Bos taurus (bovine)
Description:
Residue:
3
NA