Target
Substance-P receptor
Ligand
BDBM21021
Substrate
Substance P
Meas. Tech.
Radioligand Labeled Binding Assay
pH
7.4±n/a
Temperature
298.15±n/a K
Ki
0.29±n/a nM
Citation
 Yamamoto, TNair, PDavis, PMa, SWNavratilova, EMoye, STumati, SLai, JVanderah, TWYamamura, HIPorreca, FHruby, VJ Design, synthesis, and biological evaluation of novel bifunctional C-terminal-modified peptides for delta/mu opioid receptor agonists and neurokinin-1 receptor antagonists. J Med Chem 50:2779-86 (2007)  
Target
Name:
Substance-P receptor
Synonyms:
NK-1 receptor NK1 Receptor Neurokinin 1 receptor SPR Tac1r Tacr1
Type:
G Protein-Coupled Receptor (GPCR)
Mol. Mass.:
46371.54
Organism:
Rattus norvegicus (rat)
Description:
Competition binding assays were carried out using membrane preparations from transfected CHO cells that constitutively expressed the rat NK1 receptor.
Residue:
407
  
Inhibitor
Name:
BDBM21021
Synonyms:
Bifunctional Peptide Ligand, 5 (TY005) H-Tyr-D-Ala-Gly-Phe-Met-Pro-Leu-Trp-O-3,5-Bzl(CF3)2 | [3,5-bis(trifluoromethyl)phenyl]methyl (2S)-2-[(2S)-2-{[(2S)-1-[(2S)-2-[(2S)-2-{2-[(2R)-2-[(2S)-2-amino-3-(4-hydroxyphenyl)propanamido]propanamido]acetamido}-3-phenylpropanamido]-4-(methylsulfanyl)butanoyl]pyrrolidin-2-yl]formamido}-4-methylpentanamido]-3-(1H-indol-3-yl)propanoate
Type:
Peptide-like ligand
Emp. Form.:
C59H69F6N9O10S
Mol. Mass.:
1210.289
SMILES:
CSCC[C@H](NC(=O)[C@H](Cc1ccccc1)NC(=O)CNC(=O)[C@@H](C)NC(=O)[C@@H](N)Cc1ccc(O)cc1)C(=O)N1CCC[C@H]1C(=O)N[C@@H](CC(C)C)C(=O)N[C@@H](Cc1c[nH]c2ccccc12)C(=O)OCc1cc(cc(c1)C(F)(F)F)C(F)(F)F
:
Substrate
Name:
Substance P
Synonyms:
[3H]Substance P
Type:
Peptide
Mol. Mass.:
3794.16
Organism:
Description:
Residue:
33