Target
Sodium channel protein type 9 subunit alpha
Ligand
BDBM368255
Substrate
Meas. Tech.
Measurement of Sodium Ion Channel Blocking Effects
IC50
58.0±n/a nM
Citation
 Lee, HKim, IJung, MKim, HSLee, CHJun, SAYoon, JSKim, S Substituted benzenesulfonamides as sodium channel blockers US Patent  US10227338 Publication Date 3/12/2019 
Target
Name:
Sodium channel protein type 9 subunit alpha
Synonyms:
NENA Peripheral sodium channel 1 SCN9A_HUMAN Voltage-gated sodium channel subunit Nav1.7 hNE-Na
Type:
Protein
Mol. Mass.:
226375.97
Organism:
Homo sapiens (Human)
Description:
Q15858
Residue:
1988
  
Inhibitor
Name:
BDBM368255
Synonyms:
US10227338, Example 37
Type:
Small organic molecule
Emp. Form.:
C21H21F4N5O2S2
Mol. Mass.:
515.547
SMILES:
CNC1CCN(C1)c1cc(ccc1Nc1ccc(c(F)c1)S(=O)(=O)Nc1cscn1)C(F)(F)F
: