Target
Adenosine receptor A3
Ligand
BDBM21217
Substrate
BDBM21242
Meas. Tech.
Human A1 Adenosine Receptor Binding Assay
Ki
26±n/a nM
Citation
 Cosimelli, BGreco, GEhlardo, MNovellino, EDa Settimo, FTaliani, SLa Motta, CBellandi, MTuccinardi, TMartinelli, ACiampi, OTrincavelli, MLMartini, C Derivatives of 4-Amino-6-hydroxy-2-mercaptopyrimidine as Novel, Potent, and Selective A3 Adenosine Receptor Antagonists. J Med Chem 51:1764-70 (2008)  
Target
Name:
Adenosine receptor A3
Synonyms:
A3 adenosine receptor (hA3) ADORA3 | Adenosine A3 receptor (A3AR)
Type:
G Protein-Coupled Receptor (GPCR)
Mol. Mass.:
36197.32
Organism:
Homo sapiens (Human)
Description:
P0DMS8
Residue:
318
  
Inhibitor
Name:
BDBM21217
Synonyms:
2-(4-methyl-1H-1,3-benzodiazol-2-yl)quinoxaline benzimidazole-quinoxaline, C3
Type:
Small organic molecule
Emp. Form.:
C16H12N4
Mol. Mass.:
260.2933
SMILES:
Cc1cccc2[nH]c(nc12)-c1cnc2ccccc2n1
:
Substrate
Name:
BDBM21242
Synonyms:
(2S,3S,4R,5R)-5-(6-{[(4-aminophenyl)methyl]amino}-9H-purin-9-yl)-3,4-dihydroxy-N-methyloxolane-2-carboxamide N(6)-(4-amino-3-iodobenzyl)adenosine-5-N-methyluronamide | [3H]AB-MECA
Type:
radiolabeled ligand
Emp. Form.:
C18H21N7O4
Mol. Mass.:
399.4038
SMILES:
CNC(=O)[C@H]1O[C@H]([C@H](O)[C@@H]1O)n1cnc2c(NCc3ccc(N)cc3)ncnc12
: