Target
Apoptosis regulator Bcl-2
Ligand
BDBM21436
Substrate
Fluorescein-labeled BAX peptide
Meas. Tech.
Fluorescence Polarization Assay and FL5.12 Cellular Assay
Ki
<1±n/a nM
EC50
130±n/a nM
Citation
 Bruncko, MOost, TKBelli, BADing, HJoseph, MKKunzer, AMartineau, DMcClellan, WJMitten, MNg, SCNimmer, PMOltersdorf, TPark, CMPetros, AMShoemaker, ARSong, XWang, XWendt, MDZhang, HFesik, SWRosenberg, SHElmore, SW Studies leading to potent, dual inhibitors of Bcl-2 and Bcl-xL. J Med Chem 50:641-62 (2007)  
Target
Name:
Apoptosis regulator Bcl-2
Synonyms:
Apoptosis regulator Bcl-2 Protein BCL-2 BCL2_HUMAN | Bcl-2 Protein
Type:
Homodimer or heterodimer
Mol. Mass.:
26269.11
Organism:
Homo sapiens (Human)
Description:
P10415
Residue:
239
  
Inhibitor
Name:
BDBM21436
Synonyms:
N-Benylpiperazine derivative, 23d | N-[(4-{[(2R)-4-(dimethylamino)-1-(phenylsulfanyl)butan-2-yl]amino}-3-nitrobenzene)sulfonyl]-4-(4-{[2-(methylsulfanyl)phenyl]methyl}piperazin-1-yl)benzamide
Type:
Small organic molecule
Emp. Form.:
C37H44N6O5S3
Mol. Mass.:
748.977
SMILES:
CSc1ccccc1CN1CCN(CC1)c1ccc(cc1)C(=O)NS(=O)(=O)c1ccc(N[C@H](CCN(C)C)CSc2ccccc2)c(c1)[N+]([O-])=O
:
Substrate
Name:
Fluorescein-labeled BAX peptide
Synonyms:
Type:
fluorescein-labeled probe
Mol. Mass.:
2800.15
Organism:
Description:
Residue:
25