Target
Angiotensin-converting enzyme
Ligand
BDBM21464
Substrate
BDBM21476
Meas. Tech.
Enzyme Inhibition Assay
pH
6.8±n/a
Temperature
298.15±n/a K
Ki
>10000±n/a nM
Citation
 Mores, AMatziari, MBeau, FCuniasse, PYiotakis, ADive, V Development of Potent and Selective Phosphinic Peptide Inhibitors of Angiotensin-Converting Enzyme 2. J Med Chem 51:2216-2226 (2008)  
Target
Name:
Angiotensin-converting enzyme
Synonyms:
ACE Angiotensin converting enzyme (ACE) Angiotensin-converting enzyme, soluble form CD_antigen=CD143 DCP1 Kininase II
Type:
Enzyme
Mol. Mass.:
149709.01
Organism:
Homo sapiens (Human)
Description:
Residue:
1306
  
Inhibitor
Name:
BDBM21464
Synonyms:
2-benzyl-3-{[1-(2-acetamido-4-methylpentanoyl)pyrrolidin-2-yl](hydroxy)phosphoryl}propanoic acid The second fraction of the HPLC chromatogram.
Type:
Small organic molecule
Emp. Form.:
C22H33N2O6P
Mol. Mass.:
452.481
SMILES:
CC(C)CC(NC(C)=O)C(=O)N1CCC=C1P(O)(O)CC(Cc1ccccc1)C(O)=O
:
Substrate
Name:
BDBM21476
Synonyms:
(7-methoxycoumarin-4-yl)acetyl-Ala-Ser-Asp-Lys(3-(2,4-dinitrophenyl)-L-2,3-diaminopropionyl)-OH | Mca-Ala-Ser-Asp-Lys-Dpa-OH
Type:
Fluorogenic Substrate
Emp. Form.:
Mol. Mass.:
SMILES:
: