Target
Angiotensin-converting enzyme
Ligand
BDBM21645
Substrate
BDBM21660
Meas. Tech.
In Vitro Inhibition of NEP
Ki
33±n/a nM
Citation
 Inguimbert, NCoric, PPoras, HMeudal, HTeffot, FFournié-Zaluski, MCRoques, BP Toward an optimal joint recognition of the S1' subsites of endothelin converting enzyme-1 (ECE-1), angiotensin converting enzyme (ACE), and neutral endopeptidase (NEP). J Med Chem 45:1477-86 (2002)  
Target
Name:
Angiotensin-converting enzyme
Synonyms:
ACE_RAT Angiotensin-converting enzyme | Dcp1
Type:
PROTEIN
Mol. Mass.:
150907.81
Organism:
Rattus norvegicus
Description:
ChEMBL_35219
Residue:
1313
  
Inhibitor
Name:
BDBM21645
Synonyms:
(2S)-3-(1H-indol-3-yl)-2-[(2R,3R)-3-phenyl-2-(sulfanylmethyl)butanamido]propanoic acid | Mercaptoacyl amino acid compound, 9b
Type:
Small organic molecule
Emp. Form.:
C22H24N2O3S
Mol. Mass.:
396.503
SMILES:
C[C@H]([C@@H](CS)C(=O)N[C@@H](Cc1c[nH]c2ccccc12)C(O)=O)c1ccccc1
:
Substrate
Name:
BDBM21660
Synonyms:
N-Cbz-Phe-His-Leu
Type:
Emp. Form.:
Mol. Mass.:
SMILES:
: