Target
Cyclin-dependent kinase 2/G1/S-specific cyclin-E1
Ligand
BDBM370205
Substrate
Meas. Tech.
CDK2/Cyclin E1 Mobility Shift Assay
Ki
0.080±n/a nM
Citation
 Freeman-Cook, KDHoffman, RLNagata, ANinkovic, S CDK2/4/6 inhibitors US Patent  US10233188 Publication Date 3/19/2019 
Target
Name:
Cyclin-dependent kinase 2/G1/S-specific cyclin-E1
Synonyms:
CDK2/CycE CDK2/E Cyclin-Dependent Kinase 2 (CDK2) Cyclin-dependent kinase 2/cyclin E1
Type:
Protein
Mol. Mass.:
Description:
Components:
This complex has 2 components.
Component 1
Name:
Cyclin-dependent kinase 2
Synonyms:
CDK2 CDK2_HUMAN Cell division protein kinase 2 Protein cereblon/Cyclin-dependent kinase 2 | p33 protein kinase
Type:
Enzyme Subunit
Mol. Mass.:
33938.17
Organism:
Homo sapiens (Human)
Description:
P24941
Residue:
298
  
Component 2
Name:
G1/S-specific cyclin-E1
Synonyms:
CCNE CCNE1_HUMAN
Type:
Enzyme Subunit
Mol. Mass.:
47073.17
Organism:
Homo sapiens (Human)
Description:
Residue:
410
  
Inhibitor
Name:
BDBM370205
Synonyms:
US10233188, Example 92 US11396512, Example 92
Type:
Small organic molecule
Emp. Form.:
C20H29N5O4S
Mol. Mass.:
435.54
SMILES:
Cc1cc2cnc(NC3CCN(CC3)S(C)(=O)=O)nc2n([C@@H]2CCC[C@@]2(C)O)c1=O
: