Target
Poly(ADP-ribose) glycohydrolase
Ligand
BDBM371268
Substrate
Meas. Tech.
PARG Assay
IC50
20.0±n/a nM
Citation
 McGonagle, AEJordan, AWaszkowycz, BHutton, CWaddell, IHitchin, JRSmith, KMHamilton, NM 2,4-dioxo-quinazoline-6-sulfonamide derivatives as inhibitors of PARG US Patent  US10239843 Publication Date 3/26/2019 
Target
Name:
Poly(ADP-ribose) glycohydrolase
Synonyms:
PARG Poly(ADP-ribose) glycohydrolase | poly(ADP-ribose) glycohydrolase (PARG)
Type:
Protein
Mol. Mass.:
111107.13
Organism:
Homo sapiens (Human)
Description:
Q86W56
Residue:
976
  
Inhibitor
Name:
BDBM371268
Synonyms:
US10239843, Example 375
Type:
Small organic molecule
Emp. Form.:
C22H21N7O5S
Mol. Mass.:
495.511
SMILES:
Cc1ncc(Cn2c3ccc(cc3c(=O)n(Cc3cnn(C)c3)c2=O)S(=O)(=O)NC2(CC2)C#N)o1
: