Target
Poly(ADP-ribose) glycohydrolase
Ligand
BDBM371281
Substrate
Meas. Tech.
PARG Assay
IC50
25.0±n/a nM
Citation
 McGonagle, AEJordan, AWaszkowycz, BHutton, CWaddell, IHitchin, JRSmith, KMHamilton, NM 2,4-dioxo-quinazoline-6-sulfonamide derivatives as inhibitors of PARG US Patent  US10239843 Publication Date 3/26/2019 
Target
Name:
Poly(ADP-ribose) glycohydrolase
Synonyms:
PARG Poly(ADP-ribose) glycohydrolase | poly(ADP-ribose) glycohydrolase (PARG)
Type:
Protein
Mol. Mass.:
111107.13
Organism:
Homo sapiens (Human)
Description:
Q86W56
Residue:
976
  
Inhibitor
Name:
BDBM371281
Synonyms:
N-(1-Cyanocyclopropyl)-7-fluoro-3-[(1-methylpyrazol-4-yl)methyl]-2,4-dioxo-1H-quinazoline-6-sulfonamide | US10239843, Example 388
Type:
Small organic molecule
Emp. Form.:
C21H24FN5O4S
Mol. Mass.:
461.51
SMILES:
Cn1cc(Cn2c(=O)n(CC3CC3)c3cc(F)c(cc3c2=O)S(=O)(=O)NC2(C)CC2)cn1
: