Target
Poly(ADP-ribose) glycohydrolase
Ligand
BDBM371447
Substrate
Meas. Tech.
PARG Assay
IC50
348±n/a nM
Citation
 McGonagle, AEJordan, AWaszkowycz, BHutton, CWaddell, IHitchin, JRSmith, KMHamilton, NM 2,4-dioxo-quinazoline-6-sulfonamide derivatives as inhibitors of PARG US Patent  US10239843 Publication Date 3/26/2019 
Target
Name:
Poly(ADP-ribose) glycohydrolase
Synonyms:
PARG Poly(ADP-ribose) glycohydrolase | poly(ADP-ribose) glycohydrolase (PARG)
Type:
Protein
Mol. Mass.:
111107.13
Organism:
Homo sapiens (Human)
Description:
Q86W56
Residue:
976
  
Inhibitor
Name:
BDBM371447
Synonyms:
N-[1-(Fluoromethyl)cyclopropyl]-3-[(3-methylisoxazol-5-yl)methyl]-1-[(5-methyl-1,3,4-oxadiazol-2-yl)methyl]-2,4-dioxo-quinazoline-6-sulfonamide | US10239843, Example 556
Type:
Small organic molecule
Emp. Form.:
C21H21FN6O6S
Mol. Mass.:
504.491
SMILES:
Cc1cc(Cn2c(=O)n(Cc3nnc(C)o3)c3ccc(cc3c2=O)S(=O)(=O)NC2(CF)CC2)on1
: