Target
ADP-ribosylhydrolase ARH3
Ligand
BDBM371026
Substrate
Meas. Tech.
ARH3 Assay
IC50
>100000±n/a nM
Citation
 McGonagle, AEJordan, AWaszkowycz, BHutton, CWaddell, IHitchin, JRSmith, KMHamilton, NM 2,4-dioxo-quinazoline-6-sulfonamide derivatives as inhibitors of PARG US Patent  US10239843 Publication Date 3/26/2019 
Target
Name:
ADP-ribosylhydrolase ARH3
Synonyms:
ADP-ribose glycohydrolase ARH3 ADPRHL2 ADPRS_HUMAN O-acetyl-ADP-ribose deacetylase ARH3 [Protein ADP-ribosylarginine] hydrolase-like protein 2 | [Protein ADP-ribosylserine] hydrolase
Type:
Enzyme Catalytic Domain
Mol. Mass.:
38934.22
Organism:
Homo sapiens (Human)
Description:
Q9NX46
Residue:
363
  
Inhibitor
Name:
BDBM371026
Synonyms:
US10239843, Example 133
Type:
Small organic molecule
Emp. Form.:
C19H22N4O4S2
Mol. Mass.:
434.532
SMILES:
Cc1nc(C)c(Cn2c3ccc(cc3c(=O)n(C)c2=O)S(=O)(=O)NC2(C)CC2)s1
: