Target
ADP-ribosylhydrolase ARH3
Ligand
BDBM371463
Substrate
Meas. Tech.
ARH3 Assay
IC50
>150000±n/a nM
Citation
 McGonagle, AEJordan, AWaszkowycz, BHutton, CWaddell, IHitchin, JRSmith, KMHamilton, NM 2,4-dioxo-quinazoline-6-sulfonamide derivatives as inhibitors of PARG US Patent  US10239843 Publication Date 3/26/2019 
Target
Name:
ADP-ribosylhydrolase ARH3
Synonyms:
ADP-ribose glycohydrolase ARH3 ADPRHL2 ADPRS_HUMAN O-acetyl-ADP-ribose deacetylase ARH3 [Protein ADP-ribosylarginine] hydrolase-like protein 2 | [Protein ADP-ribosylserine] hydrolase
Type:
Enzyme Catalytic Domain
Mol. Mass.:
38934.22
Organism:
Homo sapiens (Human)
Description:
Q9NX46
Residue:
363
  
Inhibitor
Name:
BDBM371463
Synonyms:
N-[1-(Fluoromethyl)cyclopropyl]-3-[(1-methylpyrazol-4-yl)methyl]-1-[(4-methylthiazol-5-yl)methyl]-2,4-dioxo-quinazoline-6-sulfonamide | US10239843, Example 572
Type:
Small organic molecule
Emp. Form.:
C22H23FN6O4S2
Mol. Mass.:
518.584
SMILES:
Cc1ncsc1Cn1c2ccc(cc2c(=O)n(Cc2cnn(C)c2)c1=O)S(=O)(=O)NC1(CF)CC1
: