Target
Indoleamine 2,3-dioxygenase 1
Ligand
BDBM21979
Substrate
BDBM21974
Meas. Tech.
Enzyme Inhibition Assay
pH
6.5±n/a
Temperature
310.15±n/a K
Ki
190±20 nM
Citation
 Carr, GChung, MKMauk, AGAndersen, RJ Synthesis of indoleamine 2,3-dioxygenase inhibitory analogues of the sponge alkaloid exiguamine a. J Med Chem 51:2634-7 (2008)  
Target
Name:
Indoleamine 2,3-dioxygenase 1
Synonyms:
I23O1_HUMAN IDO-1 INDO Indoleamine 2,3-dioxygenase | Indoleamine-pyrrole 2,3-dioxygenase
Type:
Enzyme
Mol. Mass.:
45330.80
Organism:
Homo sapiens (Human)
Description:
P14902
Residue:
403
  
Inhibitor
Name:
BDBM21979
Synonyms:
4,7-dihydro-1H-indole-4,7-dione | Indolequinone, 19
Type:
Small organic molecule
Emp. Form.:
C8H5NO2
Mol. Mass.:
147.1308
SMILES:
O=C1C=CC(=O)c2[nH]ccc12
:
Substrate
Name:
BDBM21974
Synonyms:
(2S)-2-amino-3-(1H-indol-3-yl)propanoic acid L-tryptophan US9138393, L-Tryptophan | US9144538, L-Tryptophan
Type:
Amino Acid
Emp. Form.:
C11H12N2O2
Mol. Mass.:
204.2252
SMILES:
N[C@@H](Cc1c[nH]c2ccccc12)C(O)=O
: