Target
Cathepsin B-like cysteine protease
Ligand
BDBM22084
Substrate
BDBM22047
Meas. Tech.
Enzyme Inhibition Assay
Temperature
298.15±n/a K
IC50
7100±n/a nM
Comments
extracted
Citation
 Mallari, JPShelat, AAObrien, TCaffrey, CRKosinski, AConnelly, MHarbut, MGreenbaum, DMcKerrow, JHGuy, RK Development of potent purine-derived nitrile inhibitors of the trypanosomal protease TbcatB. J Med Chem 51:545-52 (2008)  
Target
Name:
Cathepsin B-like cysteine protease
Synonyms:
CPC Cysteine peptidase C | TbcatB
Type:
Enzyme
Mol. Mass.:
37220.37
Organism:
Trypanosoma brucei
Description:
Enzyme was expressed in yeast Pichia pastoris.
Residue:
340
  
Inhibitor
Name:
BDBM22084
Synonyms:
9-butyl-6-{[(4-fluorophenyl)methyl]amino}-9H-purine-2-carbonitrile | Compound 3{9,12}
Type:
Small organic molecule
Emp. Form.:
C17H17FN6
Mol. Mass.:
324.3555
SMILES:
CCCCn1cnc2c(NCc3ccc(F)cc3)nc(nc12)C#N
:
Substrate
Name:
BDBM22047
Synonyms:
CBZ-Phe-Arg 7-amido-4-methylcoumarin | Z-Phe-Arg-AMC
Type:
Fluorogenic substrate
Emp. Form.:
C33H36N6O6
Mol. Mass.:
612.6755
SMILES:
[#6]-c1cc(=O)oc2cc(-[#7]-[#6](=O)-[#6](-[#6]-[#6]-[#6]\[#7]=[#6](\[#7])-[#7])-[#7]-[#6](=O)-[#6](-[#6]-c3ccccc3)-[#7]-[#6](=O)-[#8]-[#6]-c3ccccc3)ccc12
: