Target
3-hydroxy-3-methylglutaryl-coenzyme A reductase
Ligand
BDBM22150
Substrate
BDBM18373
Meas. Tech.
HMG-CoA Reductase Enzyme Assay and Inhibition of Cellular Cholesterol Synthesis Assay
pH
7±n/a
Temperature
310.15±n/a K
IC50
2.4±0.9 nM
EC50
1.3±0.2 nM
Citation
 Ahmad, SMadsen, CSStein, PDJanovitz, EHuang, CNgu, KBisaha, SKennedy, LJChen, BCZhao, RSitkoff, DMonshizadegan, HYin, XRyan, CSZhang, RGiancarli, MBird, EChang, MChen, XSetters, RSearch, DZhuang, SNguyen-Tran, VCuff, CAHarrity, TDarienzo, CJLi, TReeves, RABlanar, MABarrish, JCZahler, RRobl, JA (3R,5S,E)-7-(4-(4-Fluorophenyl)-6-isopropyl-2-(methyl(1-methyl-1H-1,2,4-triazol-5-yl)amino)pyrimidin-5-yl)-3,5-dihydroxyhept-6-enoic Acid (BMS-644950): A Rationally Designed Orally Efficacious 3-Hydroxy-3-methylglutaryl Coenzyme-A Reductase Inhibitor with Reduced Myotoxicity Potential. J Med Chem 51:2722-33 (2008)  
Target
Name:
3-hydroxy-3-methylglutaryl-coenzyme A reductase
Synonyms:
HMDH_RAT Hmgcr
Type:
Enzyme
Mol. Mass.:
96689.85
Organism:
Rattus norvegicus (rat)
Description:
Isolated rat liver microsomes were used as enzyme source.
Residue:
887
  
Inhibitor
Name:
BDBM22150
Synonyms:
(3R,5S,6E)-7-[4-(4-fluorophenyl)-2-[(1-methyl-1H-pyrazol-5-yl)amino]-6-(propan-2-yl)pyrimidin-5-yl]-3,5-dihydroxyhept-6-enoic acid | pyrazole compound, 10a
Type:
Small organic molecule
Emp. Form.:
C24H28FN5O4
Mol. Mass.:
469.5086
SMILES:
CC(C)c1nc(Nc2ccnn2C)nc(-c2ccc(F)cc2)c1\C=C\[C@@H](O)C[C@@H](O)CC(O)=O
:
Substrate
Name:
BDBM18373
Synonyms:
3-Hydroxy-3-methylglutaryl-CoA | HMG-CoA
Type:
Emp. Form.:
C27H44N7O20P3S
Mol. Mass.:
911.659
SMILES:
C[C@](O)(CC(O)=O)CC(=O)SCCNC(=O)CCNC(=O)C(O)C(C)(C)COP(O)(=O)OP(O)(=O)OC[C@H]1O[C@H]([C@H](O)[C@@H]1OP(O)(O)=O)n1cnc2c(N)ncnc12
: