Target
RAF proto-oncogene serine/threonine-protein kinase
Ligand
BDBM87555
Substrate
Meas. Tech.
In Vitro Raf Activity
IC50
7.30±n/a nM
Citation
 Aversa, RJBarsanti, PABurger, MTDillon, MPDipesa, AHu, CLou, YNishiguchi, GAPan, YPolyakov, VRRamurthy, SRico, ACSetti, LQSmith, ASubramanian, STaft, BRTanner, HRWan, LYusuff, N Biaryl amide compounds as kinase inhibitors US Patent  US10245267 Publication Date 4/2/2019 
Target
Name:
RAF proto-oncogene serine/threonine-protein kinase
Synonyms:
C-Raf Protein Kinase RAF RAF1 Raf-1 Serine/threonine-protein kinase C-Raf | cRaf
Type:
Serine/threonine-protein kinase
Mol. Mass.:
73082.52
Organism:
Homo sapiens (Human)
Description:
P04049
Residue:
648
  
Inhibitor
Name:
BDBM87555
Synonyms:
US10245267, Example 736 US9694016, 736
Type:
Small organic molecule
Emp. Form.:
C26H30N8O3
Mol. Mass.:
502.5682
SMILES:
Cc1ncc(NC(=O)c2ccnc(c2)C(C)(C)C#N)cc1-c1cc(nc(NCCO)n1)N1CCOCC1
: