Target
Serine/threonine-protein kinase B-raf [V600E]
Ligand
BDBM87894
Substrate
Meas. Tech.
In Vitro Raf Activity
IC50
57.7±n/a nM
Citation
 Aversa, RJBarsanti, PABurger, MTDillon, MPDipesa, AHu, CLou, YNishiguchi, GAPan, YPolyakov, VRRamurthy, SRico, ACSetti, LQSmith, ASubramanian, STaft, BRTanner, HRWan, LYusuff, N Biaryl amide compounds as kinase inhibitors US Patent  US10245267 Publication Date 4/2/2019 
Target
Name:
Serine/threonine-protein kinase B-raf [V600E]
Synonyms:
B-RAF V600E B-Raf Protein Kinase Mutant (V600E) BRAF BRAF mutant V600E BRAF_HUMAN Protein mono-ADP-ribosyltransferase (PARP3) RAFB1 Serine/threonine-protein kinase B-raf (V600E) V-RAF murine sarcoma viral oncogene homologue B1 mutant (BRAF V600E)
Type:
Mol. Mass.:
84474.98
Organism:
Homo sapiens (Human)
Description:
P15056 V600E
Residue:
766
  
Inhibitor
Name:
BDBM87894
Synonyms:
US10245267, Example 924 US9694016, 924
Type:
Small organic molecule
Emp. Form.:
C25H27N7O4S
Mol. Mass.:
521.591
SMILES:
Cc1ncc(NC(=O)c2ccnc(c2)C(C)(C)C#N)cc1-c1cc(N2CCOCC2)c(nn1)S(C)(=O)=O
: