Target
Serine/threonine-protein kinase B-raf [V600E]
Ligand
BDBM88043
Substrate
Meas. Tech.
In Vitro Raf Activity
IC50
0.670±n/a nM
Citation
 Aversa, RJBarsanti, PABurger, MTDillon, MPDipesa, AHu, CLou, YNishiguchi, GAPan, YPolyakov, VRRamurthy, SRico, ACSetti, LQSmith, ASubramanian, STaft, BRTanner, HRWan, LYusuff, N Biaryl amide compounds as kinase inhibitors US Patent  US10245267 Publication Date 4/2/2019 
Target
Name:
Serine/threonine-protein kinase B-raf [V600E]
Synonyms:
B-RAF V600E B-Raf Protein Kinase Mutant (V600E) BRAF BRAF mutant V600E BRAF_HUMAN Protein mono-ADP-ribosyltransferase (PARP3) RAFB1 Serine/threonine-protein kinase B-raf (V600E) V-RAF murine sarcoma viral oncogene homologue B1 mutant (BRAF V600E)
Type:
Mol. Mass.:
84474.98
Organism:
Homo sapiens (Human)
Description:
P15056 V600E
Residue:
766
  
Inhibitor
Name:
BDBM88043
Synonyms:
US10245267, Example 1078 US9694016, 1078
Type:
Small organic molecule
Emp. Form.:
C27H29F2N5O3
Mol. Mass.:
509.5477
SMILES:
Cc1ccc(NC(=O)c2ccnc(c2)C(C)(F)F)cc1-c1cc(nc(c1)N1CCOCC1)N1CC(O)C1
: