Target
Nuclear receptor subfamily 5 group A member 2
Ligand
BDBM22377
Substrate
Biotinylated TIF2 Peptide
Meas. Tech.
FRET Assay for LRH-1
pH
7.5±n/a
Temperature
295.15±n/a K
EC50
160±10 nM
Citation
 Whitby, RJDixon, SMaloney, PRDelerive, PGoodwin, BJParks, DJWillson, TM Identification of small molecule agonists of the orphan nuclear receptors liver receptor homolog-1 and steroidogenic factor-1. J Med Chem 49:6652-5 (2006)  
Target
Name:
Nuclear receptor subfamily 5 group A member 2
Synonyms:
Alpha-1-fetoprotein transcription factor B1F CYP7A promoter-binding factor Hepatocytic transcription factor Liver Receptor Homolog 1 NR5A2_HUMAN hB1F | nuclear receptor subfamily 5 group A member 2 isoform 2
Type:
Nuclear Hormone Receptor
Mol. Mass.:
61341.37
Organism:
Homo sapiens (Human)
Description:
Residue:
541
  
Inhibitor
Name:
BDBM22377
Synonyms:
(3aS,6aR)-4-(4-bromophenyl)-5-[(4E)-oct-4-en-4-yl]-N-phenyl-1,2,3,3a,6,6a-hexahydropentalen-3a-amine | bicyclo[3.3.0]-oct-2-ene, 5e
Type:
Small organic molecule
Emp. Form.:
C28H34BrN
Mol. Mass.:
464.48
SMILES:
[H][C@]12CCC[C@@]1(Nc1ccccc1)C(=C(C2)C(\CCC)=C\CCC)c1ccc(Br)cc1
:
Substrate
Name:
Biotinylated TIF2 Peptide
Synonyms:
Type:
Peptide
Mol. Mass.:
3740.71
Organism:
Description:
A peptide derived from TIF2 amino acids 732-756.
Residue:
32