Target
Prostaglandin G/H synthase 2
Ligand
BDBM22569
Substrate
BDBM22319
Meas. Tech.
Time-Dependent Inhibition Assay
pH
8±n/a
Temperature
310.15±n/a K
IC50
170±n/a nM
Citation
 Harman, CATurman, MVKozak, KRMarnett, LJSmith, WLGaravito, RM Structural basis of enantioselective inhibition of cyclooxygenase-1 by S-alpha-substituted indomethacin ethanolamides. J Biol Chem 282:28096-105 (2007)  
Target
Name:
Prostaglandin G/H synthase 2
Synonyms:
COX2 Cyclooxygenase 2 (COX-2) Cyclooxygenase-2 (COX-2 AA) Cyclooxygenase-2 (COX-2) PGH2_HUMAN PHS II Prostaglandin E synthase/G/H synthase 2 Prostaglandin-endoperoxide synthase 2
Type:
Enzyme
Mol. Mass.:
69003.89
Organism:
Homo sapiens (Human)
Description:
Recombinant Cox-2 provided by Cayman (Cayman Chemical Co.,Ann Arbor, MI).
Residue:
604
  
Inhibitor
Name:
BDBM22569
Synonyms:
2-{1-[(4-chlorophenyl)carbonyl]-5-methoxy-2-methyl-1H-indol-3-yl}-N-[(2R)-1-hydroxypropan-2-yl]acetamide alpha-substituted indomethacin ethanolamide, 6
Type:
Small organic molecule
Emp. Form.:
C22H23ClN2O4
Mol. Mass.:
414.882
SMILES:
COc1ccc2n(C(=O)c3ccc(Cl)cc3)c(C)c(CC(=O)N[C@H](C)CO)c2c1
:
Substrate
Name:
BDBM22319
Synonyms:
(5Z,8Z,11Z,14Z)-icosa-5,8,11,14-tetraenoic acid Arachidonic acid (AA) [1-14C]Arachidonic acid
Type:
Unsaturated fatty acid
Emp. Form.:
C20H32O2
Mol. Mass.:
304.4669
SMILES:
CCCCC\C=C/C\C=C/C\C=C/C\C=C/CCCC(O)=O
: