Target
Liver carboxylesterase 1
Ligand
BDBM22748
Substrate
BDBM22723
Meas. Tech.
Enzyme Inhibition Assay
Ki
11.9±n/a nM
Citation
 Wadkins, RMHyatt, JLWei, XYoon, KJWierdl, MEdwards, CCMorton, CLObenauer, JCDamodaran, KBeroza, PDanks, MKPotter, PM Identification and characterization of novel benzil (diphenylethane-1,2-dione) analogues as inhibitors of mammalian carboxylesterases. J Med Chem 48:2906-15 (2005)  
Target
Name:
Liver carboxylesterase 1
Synonyms:
Carboxylesterase 1 liver carboxylesterase 1 | rCE
Type:
Enzyme
Mol. Mass.:
62292
Organism:
Oryctolagus cuniculus (rabbit)
Description:
Residue:
565
  
Inhibitor
Name:
BDBM22748
Synonyms:
1-(4-methyl-3-nitrophenyl)-2-phenylethane-1,2-dione | Benzil-based compound, 26
Type:
Small organic molecule
Emp. Form.:
C15H11NO4
Mol. Mass.:
269.2521
SMILES:
Cc1ccc(cc1[N+]([O-])=O)C(=O)C(=O)c1ccccc1
:
Substrate
Name:
BDBM22723
Synonyms:
2-nitrophenyl acetate o-NPA | o-nitrophenyl acetate
Type:
Small organic molecule
Emp. Form.:
C8H7NO4
Mol. Mass.:
181.1455
SMILES:
CC(=O)Oc1ccccc1[N+]([O-])=O
: