Target
Coagulation factor XII
Ligand
BDBM22759
Substrate
BDBM22723
Meas. Tech.
Enzyme Inhibition Assay
pH
7.4±n/a
Temperature
298.15±n/a K
Ki
5.6±0.4 nM
Citation
 Hyatt, JLWadkins, RMTsurkan, LHicks, LDHatfield, MJEdwards, CCRoss, CRCantalupo, SACrundwell, GDanks, MKGuy, RKPotter, PM Planarity and constraint of the carbonyl groups in 1,2-diones are determinants for selective inhibition of human carboxylesterase 1. J Med Chem 50:5727-34 (2007)  
Target
Name:
Coagulation factor XII
Synonyms:
Beta-factor XIIa part 1 Carboxylesterase 2 (intestine, liver) Coagulation factor XII (FXII) Coagulation factor XIIa light chain FA12_HUMAN Factor XIIa (fXIIa) Hageman factor
Type:
Enzyme
Mol. Mass.:
67810.07
Organism:
Homo sapiens (Human)
Description:
P00748
Residue:
615
  
Inhibitor
Name:
BDBM22759
Synonyms:
1-[4-(2-oxo-2-phenylacetyl)phenyl]-2-phenylethane-1,2-dione JMC505727 Compound 18
Type:
Small organic molecule
Emp. Form.:
C22H14O4
Mol. Mass.:
342.3442
SMILES:
O=C(C(=O)c1ccc(cc1)C(=O)C(=O)c1ccccc1)c1ccccc1
:
Substrate
Name:
BDBM22723
Synonyms:
2-nitrophenyl acetate o-NPA | o-nitrophenyl acetate
Type:
Small organic molecule
Emp. Form.:
C8H7NO4
Mol. Mass.:
181.1455
SMILES:
CC(=O)Oc1ccccc1[N+]([O-])=O
: