Target
Fibroblast growth factor receptor 2
Ligand
BDBM262039
Substrate
Meas. Tech.
FGFR Enzymatic Assay (pre-incubated for 4 hours)
IC50
<10±n/a nM
Citation
 Sokolsky, AWu, LYao, W Bicyclic heterocycles as FGFR4 inhibitors US Patent  US10251892 Publication Date 4/9/2019 
Target
Name:
Fibroblast growth factor receptor 2
Synonyms:
BEK FGFR-2 FGFR2 Fibroblast growth factor receptor 2 (FGFR2) KGFR Keratinocyte growth factor receptor VEGF-receptor 2 and Fibroblast growth factor receptor 2
Type:
Enzyme
Mol. Mass.:
92015.45
Organism:
Homo sapiens (Human)
Description:
P21802
Residue:
821
  
Inhibitor
Name:
BDBM262039
Synonyms:
2'-(2,6-difluoro-3,5- dimethoxyphenyl)-6'-(1-(2- morpholinoethyl)-1H-pyrazol-4- yl)-1'H-spiro[cyclopropane-1,4'- [2,7]naphthyridin]-3'(2'H)-one US10632126, Example 157 US9708318, 157
Type:
Small organic molecule
Emp. Form.:
C27H29F2N5O4
Mol. Mass.:
525.5471
SMILES:
COc1cc(OC)c(F)c(N2Cc3cnc(cc3C3(CC3)C2=O)-c2cnn(CCN3CCOCC3)c2)c1F
: