Target
Fibroblast growth factor receptor 1
Ligand
BDBM261900
Substrate
Meas. Tech.
FGFR Enzymatic Assay (pre-incubated for 10 minutes)
IC50
>200±n/a nM
Citation
 Sokolsky, AWu, LYao, W Bicyclic heterocycles as FGFR4 inhibitors US Patent  US10251892 Publication Date 4/9/2019 
Target
Name:
Fibroblast growth factor receptor 1
Synonyms:
BFGFR Basic fibroblast growth factor receptor 1 (FGFR1) CEK FGFR-1 FGFR-1, (FL) FGFR1_HUMAN FLT2 Fibroblast growth factor receptor 1 (FGFR-1) Fms-like tyrosine kinase 2 N-sam bFGF-R | c-fgr
Type:
Receptor
Mol. Mass.:
91861.70
Organism:
Homo sapiens (Human)
Description:
P11362
Residue:
822
  
Inhibitor
Name:
BDBM261900
Synonyms:
2′-(2,6-difluoro-3,5-dimethoxyphenyl)-6′-(5-morpholinopyridin-3-yl)-1′H-spiro[cyclopropane-1,4′-[2,7]naphthyridin]-3′(2′H)-one US10632126, Example 6 US9708318, 6
Type:
Small organic molecule
Emp. Form.:
C27H26F2N4O4
Mol. Mass.:
508.5165
SMILES:
COc1cc(OC)c(F)c(N2Cc3cnc(cc3C3(CC3)C2=O)-c2cncc(c2)N2CCOCC2)c1F
: