Target
Fibroblast growth factor receptor 3
Ligand
BDBM262088
Substrate
Meas. Tech.
FGFR Enzymatic Assay (pre-incubated for 10 minutes)
IC50
20±n/a nM
Citation
 Sokolsky, AWu, LYao, W Bicyclic heterocycles as FGFR4 inhibitors US Patent  US10251892 Publication Date 4/9/2019 
Target
Name:
Fibroblast growth factor receptor 3
Synonyms:
CD_antigen: CD333 FGFR3 Fibroblast growth factor receptor JTK4
Type:
Protein
Mol. Mass.:
87699.57
Organism:
Homo sapiens (Human)
Description:
P22607
Residue:
806
  
Inhibitor
Name:
BDBM262088
Synonyms:
4-(3-(2,6-difluoro-3,5-dimethoxyphenyl)-7-(1-methyl-1H-pyrazol-4-yl)-2-oxo-3,4-dihydropyrido[4,3-d]pyrimidin-1(2H)-yl)benzonitrile US11173162, Example 144 | US9708318, 144
Type:
Small organic molecule
Emp. Form.:
C26H20F2N6O3
Mol. Mass.:
502.4722
SMILES:
COc1cc(OC)c(F)c(N2Cc3cnc(cc3N(C2=O)c2ccc(cc2)C#N)-c2cnn(C)c2)c1F
: