Target
Sphingosine 1-phosphate receptor 3
Ligand
BDBM22202
Substrate
BDBM22202
Meas. Tech.
[32P] S1P Binding Assay
pH
7.5±n/a
Temperature
277.15±n/a K
Ki
5.4±0.23 nM
Citation
 Kiuchi, MAdachi, KTomatsu, AChino, MTakeda, STanaka, YMaeda, YSato, NMitsutomi, NSugahara, KChiba, K Asymmetric synthesis and biological evaluation of the enantiomeric isomers of the immunosuppressive FTY720-phosphate. Bioorg Med Chem 13:425-32 (2005)  
Target
Name:
Sphingosine 1-phosphate receptor 3
Synonyms:
C9orf108 EDG3 S1P receptor 3 S1P3 S1PR3_HUMAN Sphingosine 1-phosphate receptor 3 (S1P3) | Sphingosine 1-phosphate receptor Edg-3
Type:
G Protein-Coupled Receptor (GPCR)
Mol. Mass.:
42278.13
Organism:
Homo sapiens (Human)
Description:
Q99500
Residue:
378
  
Inhibitor
Name:
BDBM22202
Synonyms:
S1P [33P]S1P sphingosine-1-phosphate, 32P labeled {[(4Z)-2-amino-3-hydroxyoctadec-4-en-1-yl]oxy}phosphonic acid
Type:
radiolabeled ligand
Emp. Form.:
C18H38NO5P
Mol. Mass.:
379.4718
SMILES:
CCCCCCCCCCCCC\C=C/C(O)C(N)COP(O)(O)=O
:
Substrate
Name:
BDBM22202
Synonyms:
S1P [33P]S1P sphingosine-1-phosphate, 32P labeled {[(4Z)-2-amino-3-hydroxyoctadec-4-en-1-yl]oxy}phosphonic acid
Type:
radiolabeled ligand
Emp. Form.:
C18H38NO5P
Mol. Mass.:
379.4718
SMILES:
CCCCCCCCCCCCC\C=C/C(O)C(N)COP(O)(O)=O
: