Target
L-lactate dehydrogenase B chain
Ligand
BDBM23223
Substrate
BDBM19473
Meas. Tech.
Lactate Dehydrogenase Inhibition Assay
pH
7±n/a
Temperature
298.15±n/a K
IC50
9540±2870 nM
Citation
 Choi, SRPradhan, AHammond, NLChittiboyina, AGTekwani, BLAvery, MA Design, synthesis, and biological evaluation of Plasmodium falciparum lactate dehydrogenase inhibitors. J Med Chem 50:3841-50 (2007)  
Target
Name:
L-lactate dehydrogenase B chain
Synonyms:
LDH-B LDHB_BOVIN | Lactate Dehydrogenase
Type:
Oxidoreductase; homotetramer
Mol. Mass.:
36722.72
Organism:
Bos taurus (bovine)
Description:
Purified from bovine heart.
Residue:
334
  
Inhibitor
Name:
BDBM23223
Synonyms:
7-[8-formyl-1,6,7-trihydroxy-3-methyl-5-(propan-2-yl)naphthalen-2-yl]-2,3,8-trihydroxy-6-methyl-4-(propan-2-yl)naphthalene-1-carbaldehyde Gossypol Gossypol, 4 Tash 1 cid_3503
Type:
Small organic molecule
Emp. Form.:
C30H30O8
Mol. Mass.:
518.5544
SMILES:
CC(C)c1c(O)c(O)c(C=O)c2c(O)c(c(C)cc12)-c1c(C)cc2c(C(C)C)c(O)c(O)c(C=O)c2c1O
:
Substrate
Name:
BDBM19473
Synonyms:
2-Oxopropanoate Pyruvate
Type:
Small organic molecule
Emp. Form.:
C3H4O3
Mol. Mass.:
88.0621
SMILES:
CC(=O)C(O)=O
: