Target
MAP kinase-interacting serine/threonine-protein kinase 2
Ligand
BDBM181486
Substrate
Meas. Tech.
MNK2a In Vitro Kinase Assay 2
Temperature
298.15±n/a K
IC50
1.000±n/a nM
Comments
extracted
Citation
 Blum, AGottschling, DHeckel, AHehn, JPSchmid, BWiedenmayer, D Sulfoximine substituted quinazolines for pharmaceutical compositions US Patent  US9708274 Publication Date 7/18/2017 
Target
Name:
MAP kinase-interacting serine/threonine-protein kinase 2
Synonyms:
GPRK7 MAP kinase-interacting serine/threonine-protein kinase 2 (MKNK2) MAP-kinase interacting kinase 2 (MNK2) MKNK2_HUMAN | MNK2
Type:
Protein
Mol. Mass.:
51870.79
Organism:
Homo sapiens (Human)
Description:
Q9HBH9
Residue:
465
  
Inhibitor
Name:
BDBM181486
Synonyms:
US9139577, 3.047 | US9708274, 3.047
Type:
Small organic molecule
Emp. Form.:
C23H22F5N5O3S
Mol. Mass.:
543.509
SMILES:
C[C@@H](Oc1cc(F)ccc1Nc1ncnc2cc(cc(F)c12)N=S1(=O)CCCC1)C(=O)NCC(F)(F)F
: