Target
Prothrombin
Ligand
BDBM23903
Substrate
BDBM23924
Meas. Tech.
Determination of Inhibition Constants
Ki
190±n/a nM
Citation
 Steinmetzer, TSchweinitz, AStürzebecher, ADönnecke, DUhland, KSchuster, OSteinmetzer, PMüller, FFriedrich, RThan, MEBode, WStürzebecher, J Secondary amides of sulfonylated 3-amidinophenylalanine. New potent and selective inhibitors of matriptase. J Med Chem 49:4116-26 (2006)  
Target
Name:
Prothrombin
Synonyms:
Activation peptide fragment 1 Coagulation factor II Prothrombin Thrombin Thrombin light chain
Type:
Enzyme
Mol. Mass.:
70502.73
Organism:
Bos taurus (Bovine)
Description:
P00735
Residue:
625
  
Inhibitor
Name:
BDBM23903
Synonyms:
3-[(2S)-3-[4-(2-carbamimidamidoethyl)piperidin-1-yl]-2-(naphthalene-1-sulfonamido)-3-oxopropyl]benzene-1-carboximidamide | 3-amidinophenylalanine deriv., 46
Type:
Small organic molecule
Emp. Form.:
C28H35N7O3S
Mol. Mass.:
549.688
SMILES:
[#7]\[#6](-[#7])=[#7]/[#6]-[#6]-[#6]-1-[#6]-[#6]-[#7](-[#6]-[#6]-1)-[#6](=O)-[#6@H](-[#6]-c1cccc(c1)-[#6](-[#7])=[#7])-[#7]S(=O)(=O)c1cccc2ccccc12
:
Substrate
Name:
BDBM23924
Synonyms:
MeSO2-D-hexahydrotyrosyl-Gly-Arg-p-nitroanilide | MeSO2-D-hexahydrotyrosyl-Gly-Arg-pNA
Type:
Emp. Form.:
Mol. Mass.:
SMILES:
: