Target
ALK tyrosine kinase receptor
Ligand
BDBM377003
Substrate
Meas. Tech.
Enzyme Activity Inhibition IC50 Evaluation
IC50
36.0±n/a nM
Citation
 Zhang, NXu, ZWang, TWang, Y Condensed-ring pyrimidylamino derivative, preparation method therefor, and intermediate, pharmaceutical composition and applications thereof US Patent  US10259816 Publication Date 4/16/2019 
Target
Name:
ALK tyrosine kinase receptor
Synonyms:
ALK ALK_HUMAN CD_antigen: CD246
Type:
Protein
Mol. Mass.:
176453.10
Organism:
Homo sapiens (Human)
Description:
Q9UM73
Residue:
1620
  
Inhibitor
Name:
BDBM377003
Synonyms:
N-[2,2-Dimethyl-4-(piperidin-4-yl)-2,3-dihydro-1-benzofuran-7-yl]-8-(2-methoxyphenyl)quinazolin-2-amine US10611770, Compound 24
Type:
Small organic molecule
Emp. Form.:
C30H32N4O2
Mol. Mass.:
480.6007
SMILES:
COc1ccccc1-c1cccc2cnc(Nc3ccc(C4CCNCC4)c4CC(C)(C)Oc34)nc12
: