Target
N-lysine methyltransferase SMYD2
Ligand
BDBM378654
Substrate
Meas. Tech.
SMYD2 Biochemical Assay
IC50
16.4±n/a nM
Citation
 Foley, MAKuntz, KWMills, JEMitchell, LHMunchhof, MJHarvey, DM Substituted 1,2,3-triazoles as SMYD inhibitors for treating cancer US Patent  US10266526 Publication Date 4/23/2019 
Target
Name:
N-lysine methyltransferase SMYD2
Synonyms:
HSKM-B KMT3C N-lysine methyltransferase SMYD2 SET and MYND domain-containing protein 2 (SMYD2) SMYD2_HUMAN
Type:
Enzyme
Mol. Mass.:
49689.57
Organism:
Homo sapiens (Human)
Description:
Q9NRG4
Residue:
433
  
Inhibitor
Name:
BDBM378654
Synonyms:
N-{1-[(1-benzyl-1H-pyrazol-4-yl)methyl]azetidin-3-yl}-1-cyclopropyl-1H-1,2,3-triazole-4-carboxamide | US10266526, Compound 792
Type:
Small organic molecule
Emp. Form.:
C20H23N7O
Mol. Mass.:
377.4429
SMILES:
O=C(NC1CN(Cc2cnn(Cc3ccccc3)c2)C1)c1cn(nn1)C1CC1
: