Target
A disintegrin and metalloproteinase with thrombospondin motifs 5
Ligand
BDBM24104
Substrate
BDBM2
Meas. Tech.
Kinesin ATPase In Vitro Assay
pH
7±n/a
Temperature
296.15±n/a K
IC50
1.6±n/a nM
Citation
 Roecker, AJColeman, PJMercer, SPSchreier, JDBuser, CAWalsh, ESHamilton, KLobell, RBTao, WDiehl, RESouth, VJDavide, JPKohl, NEYan, YKuo, LCLi, CFernandez-Metzler, CMahan, EAPrueksaritanont, THartman, GD Kinesin spindle protein (KSP) inhibitors. Part 8: Design and synthesis of 1,4-diaryl-4,5-dihydropyrazoles as potent inhibitors of the mitotic kinesin KSP. Bioorg Med Chem Lett 17:5677-82 (2007)  
Target
Name:
A disintegrin and metalloproteinase with thrombospondin motifs 5
Synonyms:
A disintegrin and metalloproteinase with thrombospondin motifs 5 (ADAMTS-5) ADAMTS5 ATS5_HUMAN Metalloproteinase with thrombospondin motifs 5 (ADAMTS-5)
Type:
Enzyme
Mol. Mass.:
101769.09
Organism:
Homo sapiens (Human)
Description:
Q9UNA0
Residue:
930
  
Inhibitor
Name:
BDBM24104
Synonyms:
1-[(5R,6R)-5-[3-(4-acetylpiperazin-1-yl)propyl]-12-fluoro-5-phenyl-8-oxa-2,3-diazatricyclo[7.4.0.0^{2,6}]trideca-1(9),3,10,12-tetraen-4-yl]ethan-1-one dihydropyrazolobenzoxazine, 1
Type:
Small organic molecule
Emp. Form.:
C27H31FN4O3
Mol. Mass.:
478.5584
SMILES:
CC(=O)N1CCN(CCC[C@]2([C@@H]3COc4ccc(F)cc4N3N=C2C(C)=O)c2ccccc2)CC1
:
Substrate
Name:
BDBM2
Synonyms:
({[({[(2R,3S,4R,5R)-5-(6-amino-9H-purin-9-yl)-3,4-dihydroxyoxolan-2-yl]methoxy}(hydroxy)phosphoryl)oxy](hydroxy)phosphoryl}oxy)phosphonic acid Brimonidine ATP | CHEMBL14249
Type:
Nucleoside or nucleotide
Emp. Form.:
C10H16N5O13P3
Mol. Mass.:
507.181
SMILES:
Nc1ncnc2n(cnc12)[C@@H]1O[C@H](COP(O)(=O)OP(O)(=O)OP(O)(O)=O)[C@@H](O)[C@H]1O
: