Target
Mitotic checkpoint serine/threonine-protein kinase BUB1
Ligand
BDBM378980
Substrate
Meas. Tech.
Bub1 Kinase Assay
IC50
4.70±n/a nM
Citation
 Hitchcock, MMengel, APütter, VSiemeister, GWengner, AMBriem, HEis, KSchulze, VFernandez-Montalvan, AEPrechtl, SHolton, SFanghänel, JLienau, PPreusse, CGnoth, MJ Substituted benzylindazoles for use as Bub1 kinase inhibitors in the treatment of hyperproliferative diseases US Patent  US10266548 Publication Date 4/23/2019 
Target
Name:
Mitotic checkpoint serine/threonine-protein kinase BUB1
Synonyms:
BUB1 BUB1L hBUB1
Type:
PROTEIN
Mol. Mass.:
122372.31
Organism:
Homo sapiens (Human)
Description:
ChEMBL_1510603
Residue:
1085
  
Inhibitor
Name:
BDBM378980
Synonyms:
2-[1-(2-chloro-4- methoxybenzyl)- 1H-indazol-3-yl]- 5-methoxy-N- (pyridin-4- yl)pyrimidin-4- amine | US10266548, Example 2-6-1
Type:
Small organic molecule
Emp. Form.:
C25H21ClN6O2
Mol. Mass.:
472.926
SMILES:
COc1ccc(Cn2nc(-c3ncc(OC)c(Nc4ccncc4)n3)c3ccccc23)c(Cl)c1
: