Target
Fibroblast growth factor receptor 4
Ligand
BDBM261968
Substrate
Meas. Tech.
FGFR Enzymatic Assay 1
IC50
115±n/a nM
Citation
 Lu, LShen, BSokolsky, AWang, XWu, LYao, WYe, Y Bicyclic heterocycles as FGFR4 inhibitors US Patent  US9708318 Publication Date 7/18/2017 
Target
Name:
Fibroblast growth factor receptor 4
Synonyms:
CD_antigen: CD334 FGFR4 FGFR4 Fibroblast growth factor receptor JK2 TKF
Type:
Protein
Mol. Mass.:
87957.45
Organism:
Homo sapiens (Human)
Description:
P22455
Residue:
802
  
Inhibitor
Name:
BDBM261968
Synonyms:
3-(2,6-difluoro-3,5- dimethoxyphenyl)-7-(1,3- dimethyl-1H-pyrazol-4-yl)-1- ((2-methylpyridin-4-yl)methyl)- 3,4-dihydropyrido[4,3- d]pyrimidin-2(1H)-one US10632126, Example 68 US9708318, 68
Type:
Small organic molecule
Emp. Form.:
C27H26F2N6O3
Mol. Mass.:
520.5305
SMILES:
COc1cc(OC)c(F)c(N2Cc3cnc(cc3N(Cc3ccnc(C)c3)C2=O)-c2cn(C)nc2C)c1F
: