Target
Fibroblast growth factor receptor 3
Ligand
BDBM261969
Substrate
Meas. Tech.
FGFR Enzymatic Assay 1
IC50
<10±n/a nM
Citation
 Lu, LShen, BSokolsky, AWang, XWu, LYao, WYe, Y Bicyclic heterocycles as FGFR4 inhibitors US Patent  US9708318 Publication Date 7/18/2017 
Target
Name:
Fibroblast growth factor receptor 3
Synonyms:
CD_antigen: CD333 FGFR3 Fibroblast growth factor receptor JTK4
Type:
Protein
Mol. Mass.:
87699.57
Organism:
Homo sapiens (Human)
Description:
P22607
Residue:
806
  
Inhibitor
Name:
BDBM261969
Synonyms:
US10251892, Example 69 US11173162, Example 69 | US9708318, 69
Type:
Small organic molecule
Emp. Form.:
C26H24F2N6O3
Mol. Mass.:
506.504
SMILES:
COc1cc(OC)c(F)c(N2Cc3cnc(cc3N(Cc3ccncc3)C2=O)-c2cn(C)nc2C)c1F
: