Target
Fibroblast growth factor receptor 4
Ligand
BDBM262039
Substrate
Meas. Tech.
FGFR Enzymatic Assay 1
IC50
<10±n/a nM
Citation
 Lu, LShen, BSokolsky, AWang, XWu, LYao, WYe, Y Bicyclic heterocycles as FGFR4 inhibitors US Patent  US9708318 Publication Date 7/18/2017 
Target
Name:
Fibroblast growth factor receptor 4
Synonyms:
CD_antigen: CD334 FGFR4 FGFR4 Fibroblast growth factor receptor JK2 TKF
Type:
Protein
Mol. Mass.:
87957.45
Organism:
Homo sapiens (Human)
Description:
P22455
Residue:
802
  
Inhibitor
Name:
BDBM262039
Synonyms:
2'-(2,6-difluoro-3,5- dimethoxyphenyl)-6'-(1-(2- morpholinoethyl)-1H-pyrazol-4- yl)-1'H-spiro[cyclopropane-1,4'- [2,7]naphthyridin]-3'(2'H)-one US10632126, Example 157 US9708318, 157
Type:
Small organic molecule
Emp. Form.:
C27H29F2N5O4
Mol. Mass.:
525.5471
SMILES:
COc1cc(OC)c(F)c(N2Cc3cnc(cc3C3(CC3)C2=O)-c2cnn(CCN3CCOCC3)c2)c1F
: