Target
Fibroblast growth factor receptor 3
Ligand
BDBM262049
Substrate
Meas. Tech.
FGFR Enzymatic Assay 1
IC50
<10±n/a nM
Citation
 Lu, LShen, BSokolsky, AWang, XWu, LYao, WYe, Y Bicyclic heterocycles as FGFR4 inhibitors US Patent  US9708318 Publication Date 7/18/2017 
Target
Name:
Fibroblast growth factor receptor 3
Synonyms:
CD_antigen: CD333 FGFR3 Fibroblast growth factor receptor JTK4
Type:
Protein
Mol. Mass.:
87699.57
Organism:
Homo sapiens (Human)
Description:
P22607
Residue:
806
  
Inhibitor
Name:
BDBM262049
Synonyms:
6'-(1-((1-acetylazetidin-3- yl)methyl)-1H-pyrazol-4-yl)-2'- (2,6-difluoro-3,5- dimethoxyphenyl)-1'H- spiro[cyclopropane-1,4'- [2,7]naphthyridin]-3'(2'H)-one US10632126, Example 167 US9708318, 167
Type:
Small organic molecule
Emp. Form.:
C27H27F2N5O4
Mol. Mass.:
523.5312
SMILES:
COc1cc(OC)c(F)c(N2Cc3cnc(cc3C3(CC3)C2=O)-c2cnn(CC3CN(C3)C(C)=O)c2)c1F
: