Target
Hepatocyte growth factor receptor
Ligand
BDBM24751
Substrate
biotinylated gastrin substrate
Meas. Tech.
HTRF Kinase Inhibition Assay
pH
7.5±n/a
Temperature
295.15±n/a K
Ki
8.9±1.3 nM
Citation
 D'Angelo, NDBellon, SFBooker, SKCheng, YCoxon, ADominguez, CFellows, IHoffman, DHungate, RKaplan-Lefko, PLee, MRLi, CLiu, LRainbeau, EReider, PJRex, KSiegmund, ASun, YTasker, ASXi, NXu, SYang, YZhang, YBurgess, TLDussault, IKim, TS Design, synthesis, and biological evaluation of potent c-Met inhibitors. J Med Chem 51:5766-79 (2008)  
Target
Name:
Hepatocyte growth factor receptor
Synonyms:
Hepatocyte growth factor receptor Hepatocyte growth factor receptor (c-MET) MET Met proto-oncogene (hepatocyte growth factor receptor) Tyrosine-protein kinase Met (c-Met) c-Met kinase
Type:
Protein
Mol. Mass.:
155559.73
Organism:
Homo sapiens (Human)
Description:
P08581
Residue:
1390
  
Inhibitor
Name:
BDBM24751
Synonyms:
2-benzyl-5-[3-fluoro-4-({6-methoxy-7-[3-(morpholin-4-yl)propoxy]quinolin-4-yl}oxy)phenyl]-3-methyl-3,4-dihydropyrimidin-4-one | pyrimidone, 22
Type:
Small organic molecule
Emp. Form.:
C35H35FN4O5
Mol. Mass.:
610.6746
SMILES:
COc1cc2c(Oc3ccc(cc3F)-c3cnc(Cc4ccccc4)n(C)c3=O)ccnc2cc1OCCCN1CCOCC1
:
Substrate
Name:
biotinylated gastrin substrate
Synonyms:
Type:
Peptide
Mol. Mass.:
2100.22
Organism:
Description:
Residue:
17
ITINYLEEEEAYGWLDF